Corda Initial Setup


(deepthi) #1

Hi,
I just started working on corda. I installed all set up given in windows guide. I cloned project from Git.
I am getting following errors: Please help in resolving the issue.

$ ./gradlew deployNodes
Download https://repo1.maven.org/maven2/net/i2p/crypto/eddsa/0.1.0/eddsa-0.1.0.pom
Download https://jcenter.bintray.com/net/i2p/crypto/eddsa/0.1.0/eddsa-0.1.0.pom

FAILURE: Build failed with an exception.

  • Where:
    Build file ‘D:\cordapp-template\java-source\build.gradle’ line: 96

  • What went wrong:
    A problem occurred evaluating project ‘:java-source’.

Could not resolve all dependencies for configuration ‘:java-source:runtime’.
Could not resolve net.i2p.crypto:eddsa:0.1.0.
Required by:
com.template:java-source:0.1 > net.corda:core:0.9.2
Could not resolve net.i2p.crypto:eddsa:0.1.0.
Could not get resource ‘https://repo1.maven.org/maven2/net/i2p/crypto/eddsa/0.1.0/eddsa-0.1.0.pom’.
Failed to move file ‘C:\Users\deepthi.k\AppData\Local\Temp\gradle_download8357756104212500403bin’ into filestore at 'C:\Users\deepthi.k.gradle\caches\modules-2\files-2.1\net.i2p.crypto\eddsa\0.1.0\fd199339a9ba5201f9567c3e6efb3f5b332ca5d5\eddsa-0.1.0.pom’
Could not resolve net.i2p.crypto:eddsa:0.1.0.
Could not get resource ‘https://jcenter.bintray.com/net/i2p/crypto/eddsa/0.1.0/eddsa-0.1.0.pom’.
Failed to move file ‘C:\Users\deepthi.k\AppData\Local\Temp\gradle_download3775340894044386536bin’ into filestore at ‘C:\Users\deepthi.k.gradle\caches\modules-2\files-2.1\net.i2p.crypto\eddsa\0.1.0\fd199339a9ba5201f9567c3e6efb3f5b332ca5d5\eddsa-0.1.0.pom’

  • Try:
    Run with --stacktrace option to get the stack trace. Run with --info or --debug option to get more log output.

BUILD FAILED

Total time: 17.123 secs


(Charles) #2

what’s on line 96 , run it with the --stacktrace


(deepthi) #3

Hi

Gradle failed with the exception:

A problem occurred evaluating project ‘:java-source’.

Could not resolve all dependencies for configuration ‘:java-source:runtime’.
Could not resolve net.i2p.crypto:eddsa:0.1.0.
Required by:
com.template:java-source:0.1 > net.corda:core:0.9.2
Could not resolve net.i2p.crypto:eddsa:0.1.0.
Could not get resource ‘https://repo1.maven.org/maven2/net/i2p/crypto/eddsa/0.1.0/eddsa-0.1.0.pom’.
Failed to move file ‘C:\Users\deepthi.k\AppData\Local\Temp\gradle_download5624996399694255184bin’ into filestore at 'C:\Users\deepthi.k.gradle\caches\modules-2\files-2.1\net.i2p.crypto\eddsa\0.1.0\fd199339a9ba5201f9567c3e6efb3f5b332ca5d5\eddsa-0.1.0.pom’
Could not resolve net.i2p.crypto:eddsa:0.1.0.
Could not get resource ‘https://jcenter.bintray.com/net/i2p/crypto/eddsa/0.1.0/eddsa-0.1.0.pom’.
Failed to move file ‘C:\Users\deepthi.k\AppData\Local\Temp\gradle_download2383555743803452385bin’ into filestore at ‘C:\Users\deepthi.k.gradle\caches\modules-2\files-2.1\net.i2p.crypto\eddsa\0.1.0\fd199339a9ba5201f9567c3e6efb3f5b332ca5d5\eddsa-0.1.0.pom’


(deepthi) #4

Line 96 : task installJythonDeps(dependsOn: [‘build’]) {
//line 96
project.copy {
from project.configurations.runtime
into “build/jythonDeps”
}
}


(Charles) #5

it seems that u r on 0.9.2 I would get on at least release M10.1 or possibly M11 and take it from there


(deepthi) #6

I tried using M10.1 and M11.0 getting same error.


(Charles) #7

I’m cloning 11 this morning and will play with it later


(Joel Dudley) #8

Are you able to access https://repo1.maven.org/maven2/net/i2p/crypto/eddsa/0.1.0/eddsa-0.1.0.pom or https://jcenter.bintray.com/net/i2p/crypto/eddsa/0.1.0/eddsa-0.1.0.pom in a browser from the computer where you’re trying to build your nodes?


(deepthi) #9

I am getting 404(Not found) error.


(deepthi) #10

Hi I am able to access the below link still getting same error.


(deepthi) #11

Hi,

It’s trying to move file 'C:\Users\deepthi.k\AppData\Local\Temp\gradle_download6780275911154395096bin’
But there is no such files.

A problem occurred evaluating project ‘:java-source’.

Could not resolve all dependencies for configuration ‘:java-source:runtime’.
Could not resolve net.i2p.crypto:eddsa:0.1.0.
Required by:
project :java-source > net.corda:core:0.11.0


(deepthi) #12

Stack trace for building the gradle:

Download https://repo1.maven.org/maven2/net/i2p/crypto/eddsa/0.1.0/eddsa-0.1.0.pom
Download https://jcenter.bintray.com/net/i2p/crypto/eddsa/0.1.0/eddsa-0.1.0.pom

FAILURE: Build failed with an exception.

  • Where:
    Build file ‘D:\cordapp-template\java-source\build.gradle’ line: 100

  • What went wrong:
    A problem occurred evaluating project ‘:java-source’.

Could not resolve all dependencies for configuration ‘:java-source:runtime’.
Could not resolve net.i2p.crypto:eddsa:0.1.0.
Required by:
project :java-source > net.corda:core:0.11.0
Could not resolve net.i2p.crypto:eddsa:0.1.0.
Could not get resource ‘https://repo1.maven.org/maven2/net/i2p/crypto/eddsa/0.1.0/eddsa-0.1.0.pom’.
Failed to move file ‘C:\Users\deepthi.k\AppData\Local\Temp\gradle_download3691859611026692980bin’ into filestore at 'C:\Users\deepthi.k.gradle\caches\modules-2\files-2.1\net.i2p.crypto\eddsa\0.1.0\fd199339a9ba5201f9567c3e6efb3f5b332ca5d5\eddsa-0.1.0.pom’
Could not resolve net.i2p.crypto:eddsa:0.1.0.
Could not get resource ‘https://jcenter.bintray.com/net/i2p/crypto/eddsa/0.1.0/eddsa-0.1.0.pom’.
Failed to move file ‘C:\Users\deepthi.k\AppData\Local\Temp\gradle_download3285952386008762567bin’ into filestore at ‘C:\Users\deepthi.k.gradle\caches\modules-2\files-2.1\net.i2p.crypto\eddsa\0.1.0\fd199339a9ba5201f9567c3e6efb3f5b332ca5d5\eddsa-0.1.0.pom’

  • Try:
    Run with --info or --debug option to get more log output.

  • Exception is:
    org.gradle.api.GradleScriptException: A problem occurred evaluating project ‘:java-source’.
    at org.gradle.groovy.scripts.internal.DefaultScriptRunnerFactory$ScriptRunnerImpl.run(DefaultScriptRunnerFactory.java:92)
    at org.gradle.configuration.DefaultScriptPluginFactory$ScriptPluginImpl$2.run(DefaultScriptPluginFactory.java:176)
    at org.gradle.configuration.ProjectScriptTarget.addConfiguration(ProjectScriptTarget.java:77)
    at org.gradle.configuration.DefaultScriptPluginFactory$ScriptPluginImpl.apply(DefaultScriptPluginFactory.java:181)
    at org.gradle.configuration.project.BuildScriptProcessor.execute(BuildScriptProcessor.java:39)
    at org.gradle.configuration.project.BuildScriptProcessor.execute(BuildScriptProcessor.java:26)
    at org.gradle.configuration.project.ConfigureActionsProjectEvaluator.evaluate(ConfigureActionsProjectEvaluator.java:34)
    at org.gradle.configuration.project.LifecycleProjectEvaluator.doConfigure(LifecycleProjectEvaluator.java:70)
    at org.gradle.configuration.project.LifecycleProjectEvaluator.access$000(LifecycleProjectEvaluator.java:33)
    at org.gradle.configuration.project.LifecycleProjectEvaluator$1.execute(LifecycleProjectEvaluator.java:53)
    at org.gradle.configuration.project.LifecycleProjectEvaluator$1.execute(LifecycleProjectEvaluator.java:50)
    at org.gradle.internal.Transformers$4.transform(Transformers.java:169)
    at org.gradle.internal.progress.DefaultBuildOperationExecutor.run(DefaultBuildOperationExecutor.java:106)
    at org.gradle.internal.progress.DefaultBuildOperationExecutor.run(DefaultBuildOperationExecutor.java:61)
    at org.gradle.configuration.project.LifecycleProjectEvaluator.evaluate(LifecycleProjectEvaluator.java:50)
    at org.gradle.api.internal.project.DefaultProject.evaluate(DefaultProject.java:599)
    at org.gradle.api.internal.project.DefaultProject.evaluate(DefaultProject.java:125)
    at org.gradle.execution.TaskPathProjectEvaluator.configure(TaskPathProjectEvaluator.java:35)
    at org.gradle.execution.TaskPathProjectEvaluator.configureHierarchy(TaskPathProjectEvaluator.java:62)
    at org.gradle.configuration.DefaultBuildConfigurer.configure(DefaultBuildConfigurer.java:38)
    at org.gradle.initialization.DefaultGradleLauncher$ConfigureBuildAction.execute(DefaultGradleLauncher.java:233)
    at org.gradle.initialization.DefaultGradleLauncher$ConfigureBuildAction.execute(DefaultGradleLauncher.java:230)
    at org.gradle.internal.Transformers$4.transform(Transformers.java:169)
    at org.gradle.internal.progress.DefaultBuildOperationExecutor.run(DefaultBuildOperationExecutor.java:106)
    at org.gradle.internal.progress.DefaultBuildOperationExecutor.run(DefaultBuildOperationExecutor.java:56)
    at org.gradle.initialization.DefaultGradleLauncher.doBuildStages(DefaultGradleLauncher.java:160)
    at org.gradle.initialization.DefaultGradleLauncher.doBuild(DefaultGradleLauncher.java:119)
    at org.gradle.initialization.DefaultGradleLauncher.run(DefaultGradleLauncher.java:102)
    at org.gradle.launcher.exec.GradleBuildController.run(GradleBuildController.java:71)
    at org.gradle.tooling.internal.provider.ExecuteBuildActionRunner.run(ExecuteBuildActionRunner.java:28)
    at org.gradle.launcher.exec.ChainingBuildActionRunner.run(ChainingBuildActionRunner.java:35)
    at org.gradle.launcher.exec.InProcessBuildActionExecuter.execute(InProcessBuildActionExecuter.java:41)
    at org.gradle.launcher.exec.InProcessBuildActionExecuter.execute(InProcessBuildActionExecuter.java:26)
    at org.gradle.tooling.internal.provider.ContinuousBuildActionExecuter.execute(ContinuousBuildActionExecuter.java:75)
    at org.gradle.tooling.internal.provider.ContinuousBuildActionExecuter.execute(ContinuousBuildActionExecuter.java:49)
    at org.gradle.tooling.internal.provider.ServicesSetupBuildActionExecuter.execute(ServicesSetupBuildActionExecuter.java:49)
    at org.gradle.tooling.internal.provider.ServicesSetupBuildActionExecuter.execute(ServicesSetupBuildActionExecuter.java:31)
    at org.gradle.launcher.daemon.server.exec.ExecuteBuild.doBuild(ExecuteBuild.java:67)
    at org.gradle.launcher.daemon.server.exec.BuildCommandOnly.execute(BuildCommandOnly.java:36)
    at org.gradle.launcher.daemon.server.api.DaemonCommandExecution.proceed(DaemonCommandExecution.java:120)
    at org.gradle.launcher.daemon.server.exec.WatchForDisconnection.execute(WatchForDisconnection.java:47)
    at org.gradle.launcher.daemon.server.api.DaemonCommandExecution.proceed(DaemonCommandExecution.java:120)
    at org.gradle.launcher.daemon.server.exec.ResetDeprecationLogger.execute(ResetDeprecationLogger.java:26)
    at org.gradle.launcher.daemon.server.api.DaemonCommandExecution.proceed(DaemonCommandExecution.java:120)
    at org.gradle.launcher.daemon.server.exec.RequestStopIfSingleUsedDaemon.execute(RequestStopIfSingleUsedDaemon.java:34)
    at org.gradle.launcher.daemon.server.api.DaemonCommandExecution.proceed(DaemonCommandExecution.java:120)
    at org.gradle.launcher.daemon.server.exec.ForwardClientInput$2.call(ForwardClientInput.java:74)
    at org.gradle.launcher.daemon.server.exec.ForwardClientInput$2.call(ForwardClientInput.java:72)
    at org.gradle.util.Swapper.swap(Swapper.java:38)
    at org.gradle.launcher.daemon.server.exec.ForwardClientInput.execute(ForwardClientInput.java:72)
    at org.gradle.launcher.daemon.server.api.DaemonCommandExecution.proceed(DaemonCommandExecution.java:120)
    at org.gradle.launcher.daemon.server.exec.LogAndCheckHealth.execute(LogAndCheckHealth.java:55)
    at org.gradle.launcher.daemon.server.api.DaemonCommandExecution.proceed(DaemonCommandExecution.java:120)
    at org.gradle.launcher.daemon.server.exec.LogToClient.doBuild(LogToClient.java:60)
    at org.gradle.launcher.daemon.server.exec.BuildCommandOnly.execute(BuildCommandOnly.java:36)
    at org.gradle.launcher.daemon.server.api.DaemonCommandExecution.proceed(DaemonCommandExecution.java:120)
    at org.gradle.launcher.daemon.server.exec.EstablishBuildEnvironment.doBuild(EstablishBuildEnvironment.java:72)
    at org.gradle.launcher.daemon.server.exec.BuildCommandOnly.execute(BuildCommandOnly.java:36)
    at org.gradle.launcher.daemon.server.api.DaemonCommandExecution.proceed(DaemonCommandExecution.java:120)
    at org.gradle.launcher.daemon.server.exec.StartBuildOrRespondWithBusy$1.run(StartBuildOrRespondWithBusy.java:50)
    at org.gradle.launcher.daemon.server.DaemonStateCoordinator$1.run(DaemonStateCoordinator.java:297)
    at org.gradle.internal.concurrent.ExecutorPolicy$CatchAndRecordFailures.onExecute(ExecutorPolicy.java:63)
    at org.gradle.internal.concurrent.StoppableExecutorImpl$1.run(StoppableExecutorImpl.java:46)
    Caused by: org.gradle.api.artifacts.ResolveException: Could not resolve all dependencies for configuration ‘:java-source:runtime’.
    at org.gradle.api.internal.artifacts.ivyservice.DefaultLenientConfiguration.rethrowFailure(DefaultLenientConfiguration.java:178)
    at org.gradle.api.internal.artifacts.ivyservice.DefaultLenientConfiguration$1.collectFiles(DefaultLenientConfiguration.java:127)
    at org.gradle.api.internal.artifacts.configurations.DefaultConfiguration.doGetFiles(DefaultConfiguration.java:516)
    at org.gradle.api.internal.artifacts.configurations.DefaultConfiguration.getFiles(DefaultConfiguration.java:367)
    at org.gradle.api.internal.artifacts.configurations.DefaultConfiguration_Decorated.getFiles(Unknown Source)
    at org.gradle.api.internal.file.collections.DefaultFileCollectionResolveContext$FileTreeConverter.convertInto(DefaultFileCollectionResolveContext.java:202)
    at org.gradle.api.internal.file.collections.DefaultFileCollectionResolveContext.doResolve(DefaultFileCollectionResolveContext.java:114)
    at org.gradle.api.internal.file.collections.DefaultFileCollectionResolveContext.resolveAsFileTrees(DefaultFileCollectionResolveContext.java:85)
    at org.gradle.api.internal.file.collections.DefaultFileCollectionResolveContext$FileTreeConverter.convertInto(DefaultFileCollectionResolveContext.java:188)
    at org.gradle.api.internal.file.collections.DefaultFileCollectionResolveContext.doResolve(DefaultFileCollectionResolveContext.java:109)
    at org.gradle.api.internal.file.collections.DefaultFileCollectionResolveContext.resolveAsFileTrees(DefaultFileCollectionResolveContext.java:85)
    at org.gradle.api.internal.file.CompositeFileCollection$1.visitContents(CompositeFileCollection.java:111)
    at org.gradle.api.internal.file.CompositeFileTree$FilteredFileTree.visitContents(CompositeFileTree.java:114)
    at org.gradle.api.internal.file.CompositeFileCollection.getSourceCollections(CompositeFileCollection.java:171)
    at org.gradle.api.internal.file.CompositeFileTree.getSourceCollections(CompositeFileTree.java:38)
    at org.gradle.api.internal.file.CompositeFileTree.visit(CompositeFileTree.java:86)
    at org.gradle.api.internal.file.copy.CopySpecActionImpl.execute(CopySpecActionImpl.java:39)
    at org.gradle.api.internal.file.copy.CopySpecActionImpl.execute(CopySpecActionImpl.java:24)
    at org.gradle.api.internal.file.copy.DefaultCopySpec$DefaultCopySpecResolver.walk(DefaultCopySpec.java:648)
    at org.gradle.api.internal.file.copy.DefaultCopySpec.walk(DefaultCopySpec.java:458)
    at org.gradle.api.internal.file.copy.DelegatingCopySpecInternal.walk(DelegatingCopySpecInternal.java:236)
    at org.gradle.api.internal.file.copy.CopySpecBackedCopyActionProcessingStream.process(CopySpecBackedCopyActionProcessingStream.java:38)
    at org.gradle.api.internal.file.copy.DuplicateHandlingCopyActionDecorator$1.process(DuplicateHandlingCopyActionDecorator.java:44)
    at org.gradle.api.internal.file.copy.NormalizingCopyActionDecorator$1.process(NormalizingCopyActionDecorator.java:57)
    at org.gradle.api.internal.file.copy.FileCopyAction.execute(FileCopyAction.java:35)
    at org.gradle.api.internal.file.copy.NormalizingCopyActionDecorator.execute(NormalizingCopyActionDecorator.java:53)
    at org.gradle.api.internal.file.copy.DuplicateHandlingCopyActionDecorator.execute(DuplicateHandlingCopyActionDecorator.java:42)
    at org.gradle.api.internal.file.copy.CopyActionExecuter.execute(CopyActionExecuter.java:40)
    at org.gradle.api.internal.file.copy.FileCopier.doCopy(FileCopier.java:64)
    at org.gradle.api.internal.file.copy.FileCopier.copy(FileCopier.java:49)
    at org.gradle.api.internal.file.DefaultFileOperations.copy(DefaultFileOperations.java:145)
    at org.gradle.api.internal.project.DefaultProject.copy(DefaultProject.java:884)
    at org.gradle.api.internal.project.DefaultProject.copy(DefaultProject.java:880)
    at org.gradle.api.Project$copy$3.call(Unknown Source)
    at build_5hxltwvm3jnzk51i7pxyjk6yc$_run_closure5.doCall(D:\cordapp-template\java-source\build.gradle:100)
    at org.gradle.api.internal.ClosureBackedAction.execute(ClosureBackedAction.java:70)
    at org.gradle.util.ConfigureUtil.configureTarget(ConfigureUtil.java:160)
    at org.gradle.util.ConfigureUtil.configureSelf(ConfigureUtil.java:136)
    at org.gradle.api.internal.AbstractTask.configure(AbstractTask.java:528)
    at org.gradle.api.internal.project.DefaultProject.task(DefaultProject.java:1015)
    at org.gradle.internal.metaobject.BeanDynamicObject$MetaClassAdapter.invokeMethod(BeanDynamicObject.java:464)
    at org.gradle.internal.metaobject.BeanDynamicObject.invokeMethod(BeanDynamicObject.java:176)
    at org.gradle.internal.metaobject.CompositeDynamicObject.invokeMethod(CompositeDynamicObject.java:96)
    at org.gradle.internal.metaobject.MixInClosurePropertiesAsMethodsDynamicObject.invokeMethod(MixInClosurePropertiesAsMethodsDynamicObject.java:30)
    at org.gradle.groovy.scripts.BasicScript.invokeMethod(BasicScript.java:111)
    at org.gradle.groovy.scripts.BasicScript.methodMissing(BasicScript.java:120)
    at build_5hxltwvm3jnzk51i7pxyjk6yc.run(D:\cordapp-template\java-source\build.gradle:99)
    at org.gradle.groovy.scripts.internal.DefaultScriptRunnerFactory$ScriptRunnerImpl.run(DefaultScriptRunnerFactory.java:90)
    … 62 more
    Caused by: org.gradle.internal.resolve.ModuleVersionResolveException: Could not resolve net.i2p.crypto:eddsa:0.1.0.
    Required by:
    project :java-source > net.corda:core:0.11.0
    at org.gradle.api.internal.artifacts.ivyservice.ivyresolve.RepositoryChainComponentMetaDataResolver.resolveModule(RepositoryChainComponentMetaDataResolver.java:83)
    at org.gradle.api.internal.artifacts.ivyservice.ivyresolve.RepositoryChainComponentMetaDataResolver.resolve(RepositoryChainComponentMetaDataResolver.java:59)
    at org.gradle.api.internal.artifacts.ivyservice.resolveengine.ComponentResolversChain$ComponentMetaDataResolverChain.resolve(ComponentResolversChain.java:85)
    at org.gradle.api.internal.artifacts.ivyservice.clientmodule.ClientModuleResolver.resolve(ClientModuleResolver.java:45)
    at org.gradle.api.internal.artifacts.ivyservice.resolveengine.graph.DependencyGraphBuilder$ModuleVersionResolveState.resolve(DependencyGraphBuilder.java:642)
    at org.gradle.api.internal.artifacts.ivyservice.resolveengine.graph.DependencyGraphBuilder$ModuleVersionResolveState.getMetaData(DependencyGraphBuilder.java:653)
    at org.gradle.api.internal.artifacts.ivyservice.resolveengine.graph.DependencyGraphBuilder$DependencyEdge.calculateTargetConfigurations(DependencyGraphBuilder.java:291)
    at org.gradle.api.internal.artifacts.ivyservice.resolveengine.graph.DependencyGraphBuilder$DependencyEdge.attachToTargetConfigurations(DependencyGraphBuilder.java:264)
    at org.gradle.api.internal.artifacts.ivyservice.resolveengine.graph.DependencyGraphBuilder.traverseGraph(DependencyGraphBuilder.java:161)
    at org.gradle.api.internal.artifacts.ivyservice.resolveengine.graph.DependencyGraphBuilder.resolve(DependencyGraphBuilder.java:98)
    at org.gradle.api.internal.artifacts.ivyservice.resolveengine.DefaultArtifactDependencyResolver.resolve(DefaultArtifactDependencyResolver.java:88)
    at org.gradle.api.internal.artifacts.ivyservice.CacheLockingArtifactDependencyResolver$1.run(CacheLockingArtifactDependencyResolver.java:43)
    at org.gradle.internal.Factories$1.create(Factories.java:25)
    at org.gradle.cache.internal.DefaultCacheAccess.useCache(DefaultCacheAccess.java:190)
    at org.gradle.cache.internal.DefaultCacheAccess.useCache(DefaultCacheAccess.java:172)
    at org.gradle.cache.internal.DefaultPersistentDirectoryStore.useCache(DefaultPersistentDirectoryStore.java:136)
    at org.gradle.cache.internal.DefaultCacheFactory$ReferenceTrackingCache.useCache(DefaultCacheFactory.java:199)
    at org.gradle.api.internal.artifacts.ivyservice.DefaultCacheLockingManager.useCache(DefaultCacheLockingManager.java:60)
    at org.gradle.api.internal.artifacts.ivyservice.CacheLockingArtifactDependencyResolver.resolve(CacheLockingArtifactDependencyResolver.java:41)
    at org.gradle.api.internal.artifacts.ivyservice.DefaultConfigurationResolver.resolveGraph(DefaultConfigurationResolver.java:123)
    at org.gradle.api.internal.artifacts.ivyservice.ShortCircuitEmptyConfigurationResolver.resolveGraph(ShortCircuitEmptyConfigurationResolver.java:72)
    at org.gradle.api.internal.artifacts.ivyservice.ErrorHandlingConfigurationResolver.resolveGraph(ErrorHandlingConfigurationResolver.java:67)
    at org.gradle.api.internal.artifacts.configurations.DefaultConfiguration$3.execute(DefaultConfiguration.java:455)
    at org.gradle.api.internal.artifacts.configurations.DefaultConfiguration$3.execute(DefaultConfiguration.java:446)
    at org.gradle.internal.Transformers$4.transform(Transformers.java:169)
    at org.gradle.internal.progress.DefaultBuildOperationExecutor.run(DefaultBuildOperationExecutor.java:106)
    at org.gradle.internal.progress.DefaultBuildOperationExecutor.run(DefaultBuildOperationExecutor.java:56)
    at org.gradle.api.internal.artifacts.configurations.DefaultConfiguration.resolveGraphIfRequired(DefaultConfiguration.java:446)
    at org.gradle.api.internal.artifacts.configurations.DefaultConfiguration.resolveToStateOrLater(DefaultConfiguration.java:422)
    at org.gradle.api.internal.artifacts.configurations.DefaultConfiguration.doGetFiles(DefaultConfiguration.java:515)
    … 107 more
    Caused by: org.gradle.internal.resolve.ModuleVersionResolveException: Could not resolve net.i2p.crypto:eddsa:0.1.0.
    at org.gradle.api.internal.artifacts.ivyservice.ivyresolve.ErrorHandlingModuleComponentRepository$ErrorHandlingModuleComponentRepositoryAccess.resolveComponentMetaData(ErrorHandlingModuleComponentRepository.java:96)
    at org.gradle.api.internal.artifacts.ivyservice.ivyresolve.ComponentMetaDataResolveState.process(ComponentMetaDataResolveState.java:66)
    at org.gradle.api.internal.artifacts.ivyservice.ivyresolve.ComponentMetaDataResolveState.resolve(ComponentMetaDataResolveState.java:58)
    at org.gradle.api.internal.artifacts.ivyservice.ivyresolve.RepositoryChainComponentMetaDataResolver.findBestMatch(RepositoryChainComponentMetaDataResolver.java:116)
    at org.gradle.api.internal.artifacts.ivyservice.ivyresolve.RepositoryChainComponentMetaDataResolver.findBestMatch(RepositoryChainComponentMetaDataResolver.java:99)
    at org.gradle.api.internal.artifacts.ivyservice.ivyresolve.RepositoryChainComponentMetaDataResolver.resolveModule(RepositoryChainComponentMetaDataResolver.java:72)
    … 136 more
    Caused by: org.gradle.api.resources.ResourceException: Could not get resource ‘https://repo1.maven.org/maven2/net/i2p/crypto/eddsa/0.1.0/eddsa-0.1.0.pom’.
    at org.gradle.internal.resource.ResourceExceptions.failure(ResourceExceptions.java:69)
    at org.gradle.internal.resource.ResourceExceptions.getFailed(ResourceExceptions.java:52)
    at org.gradle.api.internal.artifacts.repositories.resolver.DefaultExternalResourceArtifactResolver.downloadStaticResource(DefaultExternalResourceArtifactResolver.java:106)
    at org.gradle.api.internal.artifacts.repositories.resolver.DefaultExternalResourceArtifactResolver.resolveArtifact(DefaultExternalResourceArtifactResolver.java:65)
    at org.gradle.api.internal.artifacts.repositories.resolver.ExternalResourceResolver.parseMetaDataFromArtifact(ExternalResourceResolver.java:198)
    at org.gradle.api.internal.artifacts.repositories.resolver.ExternalResourceResolver.resolveStaticDependency(ExternalResourceResolver.java:175)
    at org.gradle.api.internal.artifacts.repositories.resolver.MavenResolver.doResolveComponentMetaData(MavenResolver.java:110)
    at org.gradle.api.internal.artifacts.repositories.resolver.ExternalResourceResolver$RemoteRepositoryAccess.resolveComponentMetaData(ExternalResourceResolver.java:455)
    at org.gradle.api.internal.artifacts.ivyservice.ivyresolve.CacheLockReleasingModuleComponentsRepository$LockReleasingRepositoryAccess$2.run(CacheLockReleasingModuleComponentsRepository.java:78)
    at org.gradle.internal.Factories$1.create(Factories.java:25)
    at org.gradle.cache.internal.DefaultCacheAccess.longRunningOperation(DefaultCacheAccess.java:251)
    at org.gradle.cache.internal.DefaultCacheAccess.longRunningOperation(DefaultCacheAccess.java:323)
    at org.gradle.cache.internal.DefaultPersistentDirectoryStore.longRunningOperation(DefaultPersistentDirectoryStore.java:146)
    at org.gradle.cache.internal.DefaultCacheFactory$ReferenceTrackingCache.longRunningOperation(DefaultCacheFactory.java:189)
    at org.gradle.api.internal.artifacts.ivyservice.DefaultCacheLockingManager.longRunningOperation(DefaultCacheLockingManager.java:50)
    at org.gradle.api.internal.artifacts.ivyservice.ivyresolve.CacheLockReleasingModuleComponentsRepository$LockReleasingRepositoryAccess.resolveComponentMetaData(CacheLockReleasingModuleComponentsRepository.java:76)
    at org.gradle.api.internal.artifacts.ivyservice.ivyresolve.CachingModuleComponentRepository$ResolveAndCacheRepositoryAccess.resolveComponentMetaData(CachingModuleComponentRepository.java:312)
    at org.gradle.api.internal.artifacts.ivyservice.ivyresolve.BaseModuleComponentRepositoryAccess.resolveComponentMetaData(BaseModuleComponentRepositoryAccess.java:49)
    at org.gradle.api.internal.artifacts.ivyservice.ivyresolve.memcache.InMemoryCachedModuleComponentRepository$CachedAccess.resolveComponentMetaData(InMemoryCachedModuleComponentRepository.java:82)
    at org.gradle.api.internal.artifacts.ivyservice.ivyresolve.ErrorHandlingModuleComponentRepository$ErrorHandlingModuleComponentRepositoryAccess.resolveComponentMetaData(ErrorHandlingModuleComponentRepository.java:94)
    … 141 more
    Caused by: org.gradle.api.GradleException: Failed to move file ‘C:\Users\deepthi.k\AppData\Local\Temp\gradle_download3691859611026692980bin’ into filestore at 'C:\Users\deepthi.k.gradle\caches\modules-2\files-2.1\net.i2p.crypto\eddsa\0.1.0\fd199339a9ba5201f9567c3e6efb3f5b332ca5d5\eddsa-0.1.0.pom’
    at org.gradle.internal.resource.local.PathKeyFileStore.doAdd(PathKeyFileStore.java:140)
    at org.gradle.internal.resource.local.UniquePathKeyFileStore.doAdd(UniquePathKeyFileStore.java:49)
    at org.gradle.internal.resource.local.PathKeyFileStore.saveIntoFileStore(PathKeyFileStore.java:114)
    at org.gradle.internal.resource.local.PathKeyFileStore.move(PathKeyFileStore.java:72)
    at org.gradle.internal.resource.local.UniquePathKeyFileStore.move(UniquePathKeyFileStore.java:37)
    at org.gradle.internal.resource.local.GroupedAndNamedUniqueFileStore.move(GroupedAndNamedUniqueFileStore.java:42)
    at org.gradle.api.internal.artifacts.repositories.resolver.DefaultExternalResourceArtifactResolver$1.moveIntoCache(DefaultExternalResourceArtifactResolver.java:99)
    at org.gradle.internal.resource.transfer.DefaultCacheAwareExternalResourceAccessor$3.create(DefaultCacheAwareExternalResourceAccessor.java:209)
    at org.gradle.internal.resource.transfer.DefaultCacheAwareExternalResourceAccessor$3.create(DefaultCacheAwareExternalResourceAccessor.java:207)
    at org.gradle.cache.internal.DefaultCacheAccess.useCache(DefaultCacheAccess.java:190)
    at org.gradle.cache.internal.DefaultPersistentDirectoryStore.useCache(DefaultPersistentDirectoryStore.java:131)
    at org.gradle.cache.internal.DefaultCacheFactory$ReferenceTrackingCache.useCache(DefaultCacheFactory.java:194)
    at org.gradle.api.internal.artifacts.ivyservice.DefaultCacheLockingManager.useCache(DefaultCacheLockingManager.java:55)
    at org.gradle.internal.resource.transfer.DefaultCacheAwareExternalResourceAccessor.moveIntoCache(DefaultCacheAwareExternalResourceAccessor.java:207)
    at org.gradle.internal.resource.transfer.DefaultCacheAwareExternalResourceAccessor.copyToCache(DefaultCacheAwareExternalResourceAccessor.java:200)
    at org.gradle.internal.resource.transfer.DefaultCacheAwareExternalResourceAccessor.getResource(DefaultCacheAwareExternalResourceAccessor.java:76)
    at org.gradle.api.internal.artifacts.repositories.resolver.DefaultExternalResourceArtifactResolver.downloadStaticResource(DefaultExternalResourceArtifactResolver.java:97)
    … 158 more
    Caused by: org.gradle.api.UncheckedIOException: Failed to create parent directory ‘C:\Users\deepthi.k.gradle\caches\modules-2\files-2.1\net.i2p.crypto’ when creating directory 'C:\Users\deepthi.k.gradle\caches\modules-2\files-2.1\net.i2p.crypto\eddsa\0.1.0\fd199339a9ba5201f9567c3e6efb3f5b332ca5d5’
    at org.gradle.util.GFileUtils.mkdirs(GFileUtils.java:313)
    at org.gradle.util.GFileUtils.parentMkdirs(GFileUtils.java:275)
    at org.gradle.internal.resource.local.PathKeyFileStore.doAdd(PathKeyFileStore.java:127)
    … 174 more


(deepthi) #13

When I tried to run –info I got following output.
It says resource missing, and those paths for the links are not present.
Please help with this issue.
Download “https://jcenter.bintray.com/net/i2p/crypto/eddsa/0.1.0/eddsa-0.1.0.pom”
Resource missing. [HTTP GET: https://dl.bintray.com/kotlin/exposed/net/i2p/crypto/eddsa/0.1.0/eddsa-0.1.0.pom]
Resource missing. [HTTP HEAD: jar file of above link


(Charles) #14

did you git checkout release-M11.0, then do a build and then do deployNodes ?


(deepthi) #15

Yes. I am not able to build. When I tried to build getting same exception.


(deepthi) #16

When I tried to debug got following errors
Resource missing. [HTTP GET: https://dl.bintray.com/kotlin/exposed/net/i2p/crypto/eddsa/0.1.0/eddsa-0.1.0.pom]
Resource missing. [HTTP HEAD: https://dl.bintray.com/kotlin/exposed/net/i2p/crypto/eddsa/0.1.0/eddsa-0.1.0.jar]
Resource missing. [HTTP GET: https://jitpack.io/net/i2p/crypto/eddsa/0.1.0/eddsa-0.1.0.pom]
Resource missing. [HTTP HEAD: https://jitpack.io/net/i2p/crypto/eddsa/0.1.0/eddsa-0.1.0.jar]
Not able to open any of above links.


(Davide Coccia) #17

Hi, I had the same problem building the project with Gradle on Windows. I could make it compile and build by downloading the eddsa dependency in my local Maven repository (e.g. by adding the dendency to an existing Maven Project) and afterwards launching again the deployNodes command.
The problem seems to be just on Windows platform and I think the problem is due to permission issues while creating a directory that containst *.crypto (can you try to create a directory, in any folder, named “com.crypto” ?) .So since Gradle stores dependency in flat directory names this permission error can occur. Maven uses hierarchical / nested folder so this problem is avoided. Hope it helps.

Regards